{"text_format":"1","workbook":"xlsx","n_sheets":7,"sheets":["Calcoli","Messier","Caldwell","CDD","Costellazioni","Telescopi","Pianeti"],"not_rendered":{"charts":0,"images":2,"macros":1,"external_links":0,"defined_names":6,"comments":1,"pivot_tables":0},"unopened":[],"bounds":{"document_bytes":16777216,"sheet_cells":100000,"rows_first":2000,"rows_last":500,"rows_between":2000,"halvings":0,"cell_chars":16384,"cell_head_chars":4096},"cells_cut":0,"cells_raw":0,"read":"whole","date_system":"1900"}

{"sheet":"Calcoli","index":0,"n_rows":147,"n_cols":42,"rows_kept":147,"cut":false,"hidden":false,"merged":[[145,29,146,29],[145,30,146,32],[145,22,146,28],[145,33,146,40],[25,33,25,35],[25,36,25,38],[25,39,25,42],[30,2,30,11],[30,12,30,15],[30,16,30,19],[30,20,30,23],[30,24,30,27],[30,29,30,32],[30,33,30,35],[30,36,30,38],[30,39,30,42],[28,33,28,35],[28,36,28,38],[28,39,28,42],[29,2,29,11],[29,12,29,15],[29,16,29,19],[29,20,29,23],[29,24,29,27],[29,29,29,32],[29,33,29,35],[28,2,28,11],[28,12,28,15],[16,39,18,42],[10,2,12,11],[10,12,12,15],[10,16,12,19],[10,20,12,23],[10,29,12,42],[16,2,18,11],[25,2,25,11],[25,12,25,15],[25,16,25,19],[25,20,25,23],[25,24,25,27],[25,29,25,32],[16,12,18,15],[16,16,18,19],[16,20,18,23],[16,24,18,27],[16,29,18,32],[16,33,18,35],[23,33,23,35],[23,36,23,38],[23,39,23,42],[24,2,24,11],[24,12,24,15],[28,16,28,19],[28,20,28,23],[28,24,28,27],[28,29,28,32],[29,36,29,38],[29,39,29,42],[27,2,27,11],[146,5,146,14],[146,16,146,18],[137,3,137,15],[137,16,137,18],[140,3,141,23],[143,17,143,19],[145,3,146,4],[145,5,145,14],[145,15,146,15],[145,16,145,18],[145,19,146,19],[145,20,146,21],[129,16,129,18],[109,3,109,25],[109,26,109,31],[109,33,109,34],[113,3,114,20],[121,19,121,21],[119,12,119,13],[129,38,129,40],[132,3,133,13],[135,3,135,13],[135,14,135,18],[135,20,135,24],[126,4,126,19],[126,26,126,41],[127,16,127,18],[127,38,127,40],[128,16,128,18],[128,38,128,40],[122,19,122,21],[124,14,124,17],[124,3,124,13],[124,19,124,21],[119,3,119,11],[117,18,117,21],[118,18,118,21],[96,3,96,13],[96,14,96,15],[98,3,98,9],[98,10,98,11],[101,3,102,11],[107,3,107,41],[104,3,104,41],[105,3,105,41],[116,19,116,21],[115,26,115,28],[110,20,110,23],[116,23,116,27],[117,23,117,27],[118,23,118,27],[117,29,117,35],[116,29,116,35],[118,29,118,35],[95,3,95,13],[95,14,95,15],[89,32,89,33],[89,35,89,36],[89,37,89,41],[90,3,90,11],[90,23,90,26],[90,27,90,28],[90,30,90,31],[90,32,90,33],[90,35,90,36],[89,3,89,11],[89,23,89,26],[89,27,89,28],[89,30,89,31],[90,37,90,41],[92,12,92,14],[89,12,89,21],[90,12,90,21],[93,3,93,11],[93,12,93,14],[91,27,91,28],[92,27,92,28],[86,32,86,33],[81,3,82,7],[84,3,84,11],[84,12,84,18],[84,20,84,21],[84,22,84,23],[84,25,84,26],[84,27,84,28],[87,3,87,11],[87,12,87,18],[85,3,85,11],[85,12,85,18],[86,3,86,11],[86,12,86,18],[86,20,86,21],[86,22,86,23],[86,25,86,26],[86,27,86,28],[86,30,86,31],[54,35,54,36],[54,37,55,37],[84,30,84,31],[84,32,84,33],[78,2,79,42],[54,38,55,39],[57,23,58,26],[57,27,58,27],[57,28,57,38],[55,35,55,36],[58,28,58,38],[54,23,55,24],[54,25,55,25],[54,26,54,27],[54,28,55,28],[54,29,54,33],[54,34,55,34],[55,26,55,27],[55,29,55,33],[47,2,48,42],[41,2,41,24],[41,25,41,27],[42,2,42,24],[42,25,42,27],[43,2,43,24],[43,25,43,27],[51,38,52,38],[51,23,52,24],[51,25,52,25],[51,26,51,27],[51,29,52,29],[50,4,51,9],[51,40,52,40],[51,41,51,42],[52,26,52,27],[52,31,52,32],[52,34,52,35],[52,41,52,42],[51,30,52,30],[51,31,51,32],[51,33,52,33],[51,34,51,35],[51,36,52,37],[39,2,39,24],[39,25,39,27],[40,2,40,24],[40,25,40,27],[36,2,36,24],[36,25,36,27],[36,30,36,33],[44,2,44,24],[44,25,44,27],[36,34,36,36],[36,37,36,42],[37,2,37,24],[37,25,37,27],[37,30,37,33],[33,30,35,33],[33,34,35,36],[33,37,35,42],[38,2,38,24],[38,25,38,27],[38,30,38,33],[33,2,35,27],[31,2,31,11],[31,12,31,15],[31,16,31,19],[31,20,31,23],[31,24,31,27],[31,29,31,32],[31,33,31,35],[31,36,31,38],[31,39,31,42],[27,12,27,15],[27,16,27,19],[27,20,27,23],[27,24,27,27],[27,29,27,32],[27,33,27,35],[27,36,27,38],[27,39,27,42],[26,2,26,11],[26,12,26,15],[26,16,26,19],[26,20,26,23],[26,24,26,27],[26,29,26,32],[26,33,26,35],[26,36,26,38],[26,39,26,42],[24,36,24,38],[24,39,24,42],[22,2,22,11],[22,12,22,15],[22,16,22,19],[22,20,22,23],[22,24,22,27],[22,29,22,32],[22,33,22,35],[22,36,22,38],[22,39,22,42],[24,16,24,19],[24,20,24,23],[24,24,24,27],[24,29,24,32],[24,33,24,35],[23,2,23,11],[23,12,23,15],[23,16,23,19],[23,20,23,23],[23,24,23,27],[23,29,23,32],[20,36,20,38],[20,39,20,42],[21,2,21,11],[21,12,21,15],[21,16,21,19],[21,20,21,23],[21,24,21,27],[21,29,21,32],[21,33,21,35],[21,36,21,38],[21,39,21,42],[20,12,20,15],[20,16,20,19],[20,20,20,23],[20,24,20,27],[20,29,20,32],[20,33,20,35],[20,2,20,11],[19,2,19,11],[19,12,19,15],[19,16,19,19],[19,20,19,23],[19,24,19,27],[19,29,19,32],[1,2,2,42],[4,2,4,42],[5,2,8,42],[13,39,13,42],[14,29,14,30],[14,31,14,32],[15,2,15,27],[15,29,15,42],[13,2,13,11],[13,12,13,15],[13,16,13,19],[13,20,13,23],[13,29,13,32],[13,33,13,38],[19,33,19,35],[19,36,19,38],[19,39,19,42],[16,36,18,38]]}
[]
[null,null,"C A L C O L I   P E R   U S O   V I S U A L E"]
[]
[]
[null,null,"SCOPO DEL FOGLIO ELETTRONICO"]
[null,null,"Con questo foglio elettronico è possibile calcolare, in base al telescopio usato, tutte le caratteristiche di ogni oculare, dagli ingrandimenti ottenuti al tempo di attraversamento di un oggetto nel campo inquadrato.\nViene calcolata anche la magnitudine teorica massima raggiungibile in base al cielo ed al telescopio.\nCelle Gialle: inserimento dati, celle grige: risultati delle formule"]
[]
[]
[]
[]
[null,null,"TELESCOPIO IMPIEGATO",null,null,null,null,null,null,null,null,null,"Apertura telescopio [mm]",null,null,null,"Focale telescopio [mm]",null,null,null,"Rapporto focale [f/#]",null,null,null,null,null,null,null,null,"Utilizzo di una lente di Barlow o riduttori di focale\n[SI/NO]"]
[]
[]
[null,null,"Celestron C9¼",null,null,null,null,null,null,null,null,null,{"$f":"VLOOKUP($C$14,Telescopi!A:E,3,FALSE)","v":235},null,null,null,{"$f":"VLOOKUP($C$14,Telescopi!A:E,4,FALSE)*IF(AD14=\"NO\",1,AN14)","v":2350},null,null,null,{"$f":"$Q$14/$M$14","v":10},null,null,null,null,null,null,null,null,"NO",null,null,null,"Moltiplica",null,null,null,null,null,0.5]
[null,null,null,null,null,null,null,null,null,null,null,null,null,null,null,null,null,null,null,null,null,null,null,null,null,null,null,null,null,"SI",null,"NO"]
[null,"\n","DATI OCULARI:",null,null,null,null,null,null,null,null,null,null,null,null,null,null,null,null,null,null,null,null,null,null,null,null,null,null,"RISULTATI"]
[null,"\n","MARCA E MODELLO",null,null,null,null,null,null,null,null,null,"Focale oculare [mm]",null,null,null,"Estrazione pupillare [mm]",null,null,null,"Campo apparente [gradi]",null,null,null,"Field Stop [mm]",null,null,null,null,"Ingrand.",null,null,null,"Pupilla uscita [mm]",null,null,"Campo reale [gradi]",null,null,"Tempo attraver. [sec]"]
[]
[]
[null,null,"VIXEN LV-W",null,null,null,null,null,null,null,null,null,42,null,null,null,20,null,null,null,68,null,null,null,{"$f":"IF(U20=\"\",\"\",(U20*M20/57.3))","v":49.842931937172779},null,null,null,null,{"$f":"IF(OR($Q$14=0,C20=\"\",M20=\"\",Q20=\"\",U20=\"\"),\"\",$Q$14/M20)","v":55.952380952380949},null,null,null,{"$f":"IF(OR($M$14=0,$Q$14=0,AD20=\"\"),\"\",IF($AD$14=\"NO\",M20/$U$14,M20/$AN$14/$U$14))","v":4.2},null,null,{"$f":"IF(AH20=\"\",\"\",IF(U20/AD20>$AL$37,$AL$37,U20/AD20))","v":1.2153191489361703},null,null,{"$f":"IF($AK20=\"\",\"\",$AK20/(360/(60*60*24)))","v":291.67659574468087}]
{"$rows_left_out":128}
{"sheet":"Messier","index":1,"n_rows":111,"n_cols":13,"rows_kept":111,"cut":false,"hidden":false,"merged":[]}
["CATALOGO","NGC","Nome comune","Tipo di oggetto","Costellazione"," M.A. ","Zona","Culmine","Stagione","Dim [arcsec]","A. R. [H.m.]","Dec. [° ']",{"$f":"TODAY()","v":"2014-06-27"}]
["M1","NGC 1952","Nebulosa del Granchio","Resto di supernova","Toro",9,{"$f":"VLOOKUP(E2,Costellazioni!A:E,2,FALSE)","v":"Equatoriale"},{"$f":"VLOOKUP(E2,Costellazioni!A:E,3,FALSE)","v":"2014-01-01"},{"$f":"VLOOKUP(E2,Costellazioni!A:E,4,FALSE)","v":"Inverno"}]
["M45","NGC 1432","Pleiadi","Ammasso aperto","Toro",1.4,{"$f":"VLOOKUP(E3,Costellazioni!A:E,2,FALSE)","v":"Equatoriale"},{"$f":"VLOOKUP(E3,Costellazioni!A:E,3,FALSE)","v":"2014-01-01"},{"$f":"VLOOKUP(E3,Costellazioni!A:E,4,FALSE)","v":"Inverno"}]
["M42","NGC 1976","Nebulosa di Orione","Nebulosa diffusa","Orione",5,{"$f":"VLOOKUP(E4,Costellazioni!A:E,2,FALSE)","v":"Equatoriale"},{"$f":"VLOOKUP(E4,Costellazioni!A:E,3,FALSE)","v":"2014-01-15"},{"$f":"VLOOKUP(E4,Costellazioni!A:E,4,FALSE)","v":"Inverno"}]
["M43","NGC 1982","Nebulosa De Mairan","Nebulosa diffusa","Orione",7,{"$f":"VLOOKUP(E5,Costellazioni!A:E,2,FALSE)","v":"Equatoriale"},{"$f":"VLOOKUP(E5,Costellazioni!A:E,3,FALSE)","v":"2014-01-15"},{"$f":"VLOOKUP(E5,Costellazioni!A:E,4,FALSE)","v":"Inverno"}]
["M78","NGC 2068",null,"Nebulosa diffusa","Orione",8,{"$f":"VLOOKUP(E6,Costellazioni!A:E,2,FALSE)","v":"Equatoriale"},{"$f":"VLOOKUP(E6,Costellazioni!A:E,3,FALSE)","v":"2014-01-15"},{"$f":"VLOOKUP(E6,Costellazioni!A:E,4,FALSE)","v":"Inverno"}]
["M79","NGC 1904",null,"Ammasso globulare","Lepre",8.5,{"$f":"VLOOKUP(E7,Costellazioni!A:E,2,FALSE)","v":"Equatoriale"},{"$f":"VLOOKUP(E7,Costellazioni!A:E,3,FALSE)","v":"2014-01-15"},{"$f":"VLOOKUP(E7,Costellazioni!A:E,4,FALSE)","v":"Inverno"}]
["M36","NGC 1960",null,"Ammasso aperto","Auriga",6.5,{"$f":"VLOOKUP(E8,Costellazioni!A:E,2,FALSE)","v":"Boreale"},{"$f":"VLOOKUP(E8,Costellazioni!A:E,3,FALSE)","v":"2014-01-20"},{"$f":"VLOOKUP(E8,Costellazioni!A:E,4,FALSE)","v":"Inverno"}]
["M37","NGC 2099",null,"Ammasso aperto","Auriga",6,{"$f":"VLOOKUP(E9,Costellazioni!A:E,2,FALSE)","v":"Boreale"},{"$f":"VLOOKUP(E9,Costellazioni!A:E,3,FALSE)","v":"2014-01-20"},{"$f":"VLOOKUP(E9,Costellazioni!A:E,4,FALSE)","v":"Inverno"}]
["M38","NGC 1912",null,"Ammasso aperto","Auriga",7,{"$f":"VLOOKUP(E10,Costellazioni!A:E,2,FALSE)","v":"Boreale"},{"$f":"VLOOKUP(E10,Costellazioni!A:E,3,FALSE)","v":"2014-01-20"},{"$f":"VLOOKUP(E10,Costellazioni!A:E,4,FALSE)","v":"Inverno"}]
["M41","NGC 2287",null,"Ammasso aperto","Cane Maggiore",5,{"$f":"VLOOKUP(E11,Costellazioni!A:E,2,FALSE)","v":"Equatoriale"},{"$f":"VLOOKUP(E11,Costellazioni!A:E,3,FALSE)","v":"2014-02-01"},{"$f":"VLOOKUP(E11,Costellazioni!A:E,4,FALSE)","v":"Inverno"}]
["M35","NGC 2168",null,"Ammasso aperto","Gemelli",5.5,{"$f":"VLOOKUP(E12,Costellazioni!A:E,2,FALSE)","v":"Equatoriale"},{"$f":"VLOOKUP(E12,Costellazioni!A:E,3,FALSE)","v":"2014-02-05"},{"$f":"VLOOKUP(E12,Costellazioni!A:E,4,FALSE)","v":"Inverno"}]
["M50","NGC 2323",null,"Ammasso aperto","Unicorno",7,{"$f":"VLOOKUP(E13,Costellazioni!A:E,2,FALSE)","v":"Equatoriale"},{"$f":"VLOOKUP(E13,Costellazioni!A:E,3,FALSE)","v":"2014-02-05"},{"$f":"VLOOKUP(E13,Costellazioni!A:E,4,FALSE)","v":"Inverno"}]
["M46","NGC 2437",null,"Ammasso aperto","Poppa",6.5,{"$f":"VLOOKUP(E14,Costellazioni!A:E,2,FALSE)","v":"Australe"},{"$f":"VLOOKUP(E14,Costellazioni!A:E,3,FALSE)","v":"2014-02-17"},{"$f":"VLOOKUP(E14,Costellazioni!A:E,4,FALSE)","v":"Inverno"}]
["M47","NGC 2422",null,"Ammasso aperto","Poppa",4.5,{"$f":"VLOOKUP(E15,Costellazioni!A:E,2,FALSE)","v":"Australe"},{"$f":"VLOOKUP(E15,Costellazioni!A:E,3,FALSE)","v":"2014-02-17"},{"$f":"VLOOKUP(E15,Costellazioni!A:E,4,FALSE)","v":"Inverno"}]
["M93","NGC 2447",null,"Ammasso aperto","Poppa",6.5,{"$f":"VLOOKUP(E16,Costellazioni!A:E,2,FALSE)","v":"Australe"},{"$f":"VLOOKUP(E16,Costellazioni!A:E,3,FALSE)","v":"2014-02-17"},{"$f":"VLOOKUP(E16,Costellazioni!A:E,4,FALSE)","v":"Inverno"}]
["M44","NGC 2632","Presepe","Ammasso aperto","Cancro",3.1,{"$f":"VLOOKUP(E17,Costellazioni!A:E,2,FALSE)","v":"Equatoriale"},{"$f":"VLOOKUP(E17,Costellazioni!A:E,3,FALSE)","v":"2014-02-28"},{"$f":"VLOOKUP(E17,Costellazioni!A:E,4,FALSE)","v":"Inverno"}]
["M67","NGC 2682",null,"Ammasso aperto","Cancro",7.5,{"$f":"VLOOKUP(E18,Costellazioni!A:E,2,FALSE)","v":"Equatoriale"},{"$f":"VLOOKUP(E18,Costellazioni!A:E,3,FALSE)","v":"2014-02-28"},{"$f":"VLOOKUP(E18,Costellazioni!A:E,4,FALSE)","v":"Inverno"}]
["M105","NGC 3379",null,"Galassia ellittica","Leone",11,{"$f":"VLOOKUP(E19,Costellazioni!A:E,2,FALSE)","v":"Equatoriale"},{"$f":"VLOOKUP(E19,Costellazioni!A:E,3,FALSE)","v":"2014-04-01"},{"$f":"VLOOKUP(E19,Costellazioni!A:E,4,FALSE)","v":"Primavera"}]
["M65","NGC 3623",null,"Galassia spirale","Leone",10.5,{"$f":"VLOOKUP(E20,Costellazioni!A:E,2,FALSE)","v":"Equatoriale"},{"$f":"VLOOKUP(E20,Costellazioni!A:E,3,FALSE)","v":"2014-04-01"},{"$f":"VLOOKUP(E20,Costellazioni!A:E,4,FALSE)","v":"Primavera"}]
{"$rows_left_out":92}
{"sheet":"Caldwell","index":2,"n_rows":110,"n_cols":13,"rows_kept":110,"cut":false,"hidden":false,"merged":[]}
["CATALOGO","NGC","Nome comune","Tipo di oggetto","Costellazione"," M.A. ","Zona","Culmine","Stagione","Dim [arcsec]","A. R. [H.m.]","Dec. [° ']",{"$f":"TODAY()","v":"2014-06-27"}]
["C41","MELOTTE 25","THE HYDES","Ammasso aperto","Toro","0.5",{"$f":"VLOOKUP(E2,Costellazioni!A:E,2,FALSE)","v":"Equatoriale"},{"$f":"VLOOKUP(E2,Costellazioni!A:E,3,FALSE)","v":"2014-01-01"},{"$f":"VLOOKUP(E2,Costellazioni!A:E,4,FALSE)","v":"Inverno"},330,"04 27","+ 16 00"]
["C73","NGC 1851",null,"Ammasso globulare","Colomba","7.1",{"$f":"VLOOKUP(E3,Costellazioni!A:E,2,FALSE)","v":"Australe"},{"$f":"VLOOKUP(E3,Costellazioni!A:E,3,FALSE)","v":"2014-01-16"},{"$f":"VLOOKUP(E3,Costellazioni!A:E,4,FALSE)","v":"Inverno"},11,"05 41","- 40 03"]
["C103","NGC 2070","NEBULOSA TARANTOLA","Nebulosa","Dorado",8,{"$f":"VLOOKUP(E4,Costellazioni!A:E,2,FALSE)","v":"Australe"},{"$f":"VLOOKUP(E4,Costellazioni!A:E,3,FALSE)","v":"2014-01-16"},{"$f":"VLOOKUP(E4,Costellazioni!A:E,4,FALSE)","v":"Inverno"},"40 x 25","05 38","- 69 05"]
["C31","IC 405","FLAMING STAR NEBULA","Nebulosa a emissione","Auriga","10.0",{"$f":"VLOOKUP(E5,Costellazioni!A:E,2,FALSE)","v":"Boreale"},{"$f":"VLOOKUP(E5,Costellazioni!A:E,3,FALSE)","v":"2014-01-20"},{"$f":"VLOOKUP(E5,Costellazioni!A:E,4,FALSE)","v":"Inverno"},"10 x 30","05 16","+ 34 16"]
["C5","IC 342",null,"Galassia spirale","Giraffa","9.1",{"$f":"VLOOKUP(E6,Costellazioni!A:E,2,FALSE)","v":"Boreale"},{"$f":"VLOOKUP(E6,Costellazioni!A:E,3,FALSE)","v":"2014-01-23"},{"$f":"VLOOKUP(E6,Costellazioni!A:E,4,FALSE)","v":"Inverno"},"21.4 x 20.9","03 46","+ 68 05"]
["C7","NGC 2403",null,"Galassia spirale","Giraffa","8.9",{"$f":"VLOOKUP(E7,Costellazioni!A:E,2,FALSE)","v":"Boreale"},{"$f":"VLOOKUP(E7,Costellazioni!A:E,3,FALSE)","v":"2014-01-23"},{"$f":"VLOOKUP(E7,Costellazioni!A:E,4,FALSE)","v":"Inverno"},"21.9 x 12.3","07 36","+ 65 36"]
["C58","NGC 2360",null,"Ammasso aperto","Cane Maggiore","7.2",{"$f":"VLOOKUP(E8,Costellazioni!A:E,2,FALSE)","v":"Equatoriale"},{"$f":"VLOOKUP(E8,Costellazioni!A:E,3,FALSE)","v":"2014-02-01"},{"$f":"VLOOKUP(E8,Costellazioni!A:E,4,FALSE)","v":"Inverno"},13,"07 17","- 17 37"]
["C64","NGC 2362",null,"Ammasso aperto","Cane Maggiore","4.1",{"$f":"VLOOKUP(E9,Costellazioni!A:E,2,FALSE)","v":"Equatoriale"},{"$f":"VLOOKUP(E9,Costellazioni!A:E,3,FALSE)","v":"2014-02-01"},{"$f":"VLOOKUP(E9,Costellazioni!A:E,4,FALSE)","v":"Inverno"},8,"07 18","- 24 57"]
["C39","NGC 2392","ESKIMO GALAXI","Nebulosa planetaria","Gemelli","10.1",{"$f":"VLOOKUP(E10,Costellazioni!A:E,2,FALSE)","v":"Equatoriale"},{"$f":"VLOOKUP(E10,Costellazioni!A:E,3,FALSE)","v":"2014-02-05"},{"$f":"VLOOKUP(E10,Costellazioni!A:E,4,FALSE)","v":"Inverno"},"48 x 48","07 29","+ 20 54"]
["C46","NGC 2261","HUBBLE'S VARIABLE NEBULA","Nebulosa a riflessione","Unicorno",9,{"$f":"VLOOKUP(E11,Costellazioni!A:E,2,FALSE)","v":"Equatoriale"},{"$f":"VLOOKUP(E11,Costellazioni!A:E,3,FALSE)","v":"2014-02-05"},{"$f":"VLOOKUP(E11,Costellazioni!A:E,4,FALSE)","v":"Inverno"},"2 x 1","06 39","+ 08 44"]
["C49","NGC 2237-9","NEBULOSA ROSETTA","Nebulosa diffusa","Unicorno","4.8",{"$f":"VLOOKUP(E12,Costellazioni!A:E,2,FALSE)","v":"Equatoriale"},{"$f":"VLOOKUP(E12,Costellazioni!A:E,3,FALSE)","v":"2014-02-05"},{"$f":"VLOOKUP(E12,Costellazioni!A:E,4,FALSE)","v":"Inverno"},"80 x 60","06 32","+ 05 03"]
["C50","NGC 2244",null,"Ammasso aperto","Unicorno","4.8",{"$f":"VLOOKUP(E13,Costellazioni!A:E,2,FALSE)","v":"Equatoriale"},{"$f":"VLOOKUP(E13,Costellazioni!A:E,3,FALSE)","v":"2014-02-05"},{"$f":"VLOOKUP(E13,Costellazioni!A:E,4,FALSE)","v":"Inverno"},24,"06 31","+ 04 57"]
["C54","NGC 2506",null,"Ammasso aperto","Unicorno","7.6",{"$f":"VLOOKUP(E14,Costellazioni!A:E,2,FALSE)","v":"Equatoriale"},{"$f":"VLOOKUP(E14,Costellazioni!A:E,3,FALSE)","v":"2014-02-05"},{"$f":"VLOOKUP(E14,Costellazioni!A:E,4,FALSE)","v":"Inverno"},8,"08 00","- 10 56"]
["C37","NGC 6885",null,"Ammasso aperto","Pesce volante","8.2",{"$f":"VLOOKUP(E15,Costellazioni!A:E,2,FALSE)","v":"Australe"},{"$f":"VLOOKUP(E15,Costellazioni!A:E,3,FALSE)","v":"2014-02-17"},{"$f":"VLOOKUP(E15,Costellazioni!A:E,4,FALSE)","v":"Inverno"},18,"20 12","+ 26 29"]
["C71","NGC 2477",null,"Ammasso aperto","Poppa","5.8",{"$f":"VLOOKUP(E16,Costellazioni!A:E,2,FALSE)","v":"Australe"},{"$f":"VLOOKUP(E16,Costellazioni!A:E,3,FALSE)","v":"2014-02-17"},{"$f":"VLOOKUP(E16,Costellazioni!A:E,4,FALSE)","v":"Inverno"},27,"07 52","- 38 33"]
["C25","NGC 2419",null,"Ammasso globulare","Lince","9.06",{"$f":"VLOOKUP(E17,Costellazioni!A:E,2,FALSE)","v":"Boreale"},{"$f":"VLOOKUP(E17,Costellazioni!A:E,3,FALSE)","v":"2014-02-19"},{"$f":"VLOOKUP(E17,Costellazioni!A:E,4,FALSE)","v":"Inverno"},6,"07 38","+ 38 53"]
["C90","NGC 2867",null,"Nebulosa planetaria","Carena","9.7",{"$f":"VLOOKUP(E18,Costellazioni!A:E,2,FALSE)","v":"Australe"},{"$f":"VLOOKUP(E18,Costellazioni!A:E,3,FALSE)","v":"2014-03-02"},{"$f":"VLOOKUP(E18,Costellazioni!A:E,4,FALSE)","v":"Inverno"},12,"09 21","- 58 18"]
["C91","NGC 3532","AMMASSO POZZO DEI DESIDERI","Ammasso aperto","Carena","3.0",{"$f":"VLOOKUP(E19,Costellazioni!A:E,2,FALSE)","v":"Australe"},{"$f":"VLOOKUP(E19,Costellazioni!A:E,3,FALSE)","v":"2014-03-02"},{"$f":"VLOOKUP(E19,Costellazioni!A:E,4,FALSE)","v":"Inverno"},50,"11 06","- 58 40"]
["C92","NGC 3372","NEBULOSA DELLA CARENA","Nebulosa a emissione","Carena","3.0",{"$f":"VLOOKUP(E20,Costellazioni!A:E,2,FALSE)","v":"Australe"},{"$f":"VLOOKUP(E20,Costellazioni!A:E,3,FALSE)","v":"2014-03-02"},{"$f":"VLOOKUP(E20,Costellazioni!A:E,4,FALSE)","v":"Inverno"},"120 x 120","10 45","- 58 52"]
{"$rows_left_out":91}
{"sheet":"CDD","index":3,"n_rows":64,"n_cols":9,"rows_kept":64,"cut":false,"hidden":false,"merged":[]}
["Camere CCD","Sensore","Tipo","Form","HS","VS","Risoluzione","HP","VP"]
["AstroLumina Alccd 5.2, QHY6","Sony ICX259AL","CCD","1/3\"",4.8899999999999997,3.64,"752 x 582",6.5,6.25]
["AstroLumina ALccd 6C/6Pro","Sony ICX453AQ","CCD","1.8\"",23.65,15.72,"3032 x 2016",7.8,7.8]
["Atik 16","Sony ICX429AKL[AL/ALL]","CCD","1/2\"",6.47,4.83,"752 x 582",8.6,8.3000000000000007]
["Atik 16HR","Sony ICX285AL[AQ]","CCD","2/3\"",8.9700000000000006,6.71,"1390 x 1040",6.45,6.45]
["Atik 16IC","Sony ICX424AL","CCD","1/3\"",4.88,3.66,"659 x 494",7.4,7.4]
["Atik 16IC-S","Sony ICX415AL","CCD","1/2\"",6.49,4.3,"782 x 582",8.3000000000000007,8.3000000000000007]
["Atik 314E/EC","Sony ICX205AK[AL]","CCD","1/2\"",5.95,4.46,"1280 x 960",4.6500000000000004,4.6500000000000004]
["Atik 314L/L+/LC+","Sony ICX285AL[AQ]","CCD","2/3\"",8.9700000000000006,6.71,"1390 x 1040",6.45,6.45]
["Atik 383L+","Kodak KAF-8300","CCD","4/3\"",18.13,13.69,"3358 x 2536",5.4,5.4]
["Atik Titan","Sony ICX424AL","CCD","1/3\"",4.88,3.66,"659 x 494",7.4,7.4]
["Celestron Neximage","Sony ICX098AK[BQ/AL]","CCD","1/4\"",3.58,2.67,"640 x 480",5.6,5.6]
["Imaging Source DMK/DFK/DBK 21AU04.AS","Sony ICX098AK[BQ/AL]","CCD","1/4\"",3.58,2.67,"640 x 480",5.6,5.6]
["Imaging Source DMK/DFK/DBK 21AU618.AS","Sony ICX618ALA","CCD","1/4\"",4.46,3.8,"640 x 480",5.6,5.6]
["Imaging Source DMK/DFK/DBK 31AU03.AS","Sony ICX204AK[AL]","CCD","1/3\"",4.76,3.57,"1024 x 768",4.6500000000000004,4.6500000000000004]
["Imaging Source DMK/DFK/DBK 41AU02.AS","Sony ICX205AK[AL]","CCD","1/2\"",5.95,4.46,"1280 x 960",4.6500000000000004,4.6500000000000004]
["Imaging Source DMK/DFK/DBK 51AU02.AS","Sony ICX274AQ","CCD","1/1.8\"",8.5,6.8,"1600 x 1200",4.4000000000000004,4.4000000000000004]
["I-Tec iCam CCD","Sony ICX098AK[BQ/AL]","CCD","1/4\"",3.58,2.67,"640 x 480",5.6,5.6]
["Magzero I-Nova PLA-C+","Sony ICX098BQ","CCD","1/4\"",3.58,2.67,"640 x 480",5.6,5.6]
["Magzero I-Nova PLA-Mx","Sony ICX618ALA ","CCD","1/4\"",4.46,3.8,"640 x 480",5.6,5.6]
{"$rows_left_out":45}
{"sheet":"Costellazioni","index":4,"n_rows":89,"n_cols":5,"rows_kept":89,"cut":false,"hidden":true,"merged":[]}
["COSTELLAZIONE","TIPO","CULMINAZIONE","STAGIONE","STELLA DI RIFERIMENTO"]
["Acquario","Equatoriale","2014-09-25",{"$f":"IF(AND(C2>=41719,C2<41811),\"Primavera\",IF(AND(C2>=41811,C2<41905),\"Estate\",IF(AND(C2>=41905,C2<41994),\"Autunno\",IF(OR(C2<41719,C2>=41994),\"Inverno\"))))","v":"Autunno"},"Sadalmelik"]
["Altare","Australe","2014-06-10","Primavera"]
["Andromeda","Boreale","2014-11-10","Autunno","Alpheratz o Sirrah"]
["Aquila","Equatoriale","2014-08-15","Estate","Altair"]
["Ariete","Equatoriale","2014-11-30","Autunno","Hamal"]
["Auriga","Boreale","2014-01-20","Inverno","Capella"]
["Balena","Equatoriale","2014-11-10","Autunno","Menkar, Deneb Kaitos"]
["Bilancia","Equatoriale","2014-06-10","Primavera","Zuben Elgenubi"]
["Boote","Equatoriale","2014-06-02","Primavera","Arturo"]
["Bulino","Australe","2014-11-30","Autunno"]
["Bussola","Australe","2014-03-06","Inverno"]
["Camaleonte","Australe","2014-03-30","Primavera"]
["Cancro","Equatoriale","2014-02-28","Inverno","Acubens"]
["Cane Maggiore","Equatoriale","2014-02-01","Inverno","Sirio"]
["Cane Minore","Equatoriale","2014-02-15","Inverno","Procione"]
["Cani da Caccia","Boreale","2014-05-07","Primavera","Cor Caroli"]
["Capricorno","Equatoriale","2014-09-08","Estate","Al Giedi"]
["Carena","Australe","2014-03-02","Inverno","Canopo"]
["Cassiopea","Boreale","2014-11-09","Autunno","Schedar"]
{"$rows_left_out":70}
{"sheet":"Telescopi","index":5,"n_rows":47,"n_cols":5,"rows_kept":47,"cut":false,"hidden":false,"merged":[]}
["Modello","Tipo","D","LF","RF"]
["Astro-Tech AT 90EDT, TS TL APO 906T","Rifrattore",90,600,{"$f":"D2/C2","v":6.666666666666667}]
["Celestron C11","Smith-Cassegrain",280,2800,10]
["Celestron C6","Smith-Cassegrain",150,1500,10]
["Celestron C8, Meade 8\"","Smith-Cassegrain",203,2032,10.009852216748769]
["Celestron C9¼","Smith-Cassegrain",235,2350,10]
["GSO RC 10\"","Ritchey-Chrétien",254,2000,7.8740157480314963]
["GSO RC 8\"","Ritchey-Chrétien",203,1624,8]
["Guida 50mm (cercatore)","Rifrattore",50,162,3.24]
["Guida 60/228","Rifrattore",60,228,3.8]
["Guida 80/328","Rifrattore",80,328,4.0999999999999996]
["Meade ACF 10\"","Smith-Cassegrain",250,2500,10]
["Meade ACF 12\"","Smith-Cassegrain",300,3000,10]
["Meade Starfinder 12\"","Dobson",300,1500,5]
["Mizar 110mm","Newton",110,720,6.5454545454545459]
["Nikkor Ai-S 200mm F4","Obbiettivo",50,200,4]
["Pentacon Electric 135mm F2.8 M42","Obbiettivo",48,135,2.8125]
["Pentacon Six 300mm F4 M42","Obbiettivo",75,300,4]
["Rifrattore 80/480","Rifrattore",80,480,6]
["Scopos 66","Rifrattore",66,400,6.0606060606060606]
{"$rows_left_out":28}
{"sheet":"Pianeti","index":6,"n_rows":10,"n_cols":4,"rows_kept":10,"cut":false,"hidden":true,"merged":[]}
["PIANETA","DISTANZA MEDIA MASSIMA ELONGAZIONE OPPOSIZIONE [Km]","PERIODO DI ROTAZIONE [secondi]","RAGGIO [Km]"]
["Mercurio",{"$f":"1.2*10^6","v":1200000},{"$f":"5.08*10^6","v":5080000},2440]
["Venere",{"$f":"1.03*10^6","v":1030000},{"$f":"2.11*10^7","v":21100000},6050]
["Marte",{"$f":"78*10^6","v":78000000},{"$f":"8.9*10^4","v":89000},3400]
["Giove",{"$f":"589*10^6","v":589000000},{"$f":"3.58*10^4","v":35800},71500]
["Saturno",{"$f":"1195*10^6","v":1195000000},{"$f":"3.84*10^4","v":38400},60270]
["Urano",{"$f":"2582*10^6","v":2582000000},{"$f":"6.22*10^4","v":62200},25570]
["Nettuno",{"$f":"4306*10^6","v":4306000000},{"$f":"5.81*10^4","v":58099.999999999993},24750]
["Sole",{"$f":"149.6*10^6","v":149600000},{"$f":"2.19*10^6","v":2190000},695000]
["Luna",{"$f":"3.84*10^5","v":384000},{"$f":"2.55*10^6","v":2550000},1380]